Home > Ended Prematurely > Installation Premature Error

Installation Premature Error


I know the info above is sparse, so if anyone thinks they can help please let me know what I can add for your help. Won't work without not installing performance counters. What should I do? Personal Open source Business Explore Sign up Sign in Pricing Blog Support Search GitHub This repository Watch 1,901 Star 27,835 Fork 4,596 nodejs/node Code Issues 576 Pull requests 275 Projects 2 Wiki Pulse Graphs New issue node.js Setup Wizard ended prematurely #4329 Closed samarthRT opened this Issue Dec 17, 2015 · 21 comments Projects None yet Labels install windows Milestone No milestone Assignees No one assigned 15 participants samarthRT commented Dec 17, 2015 I get an error when I insall node.js on "Windows 10 pro" 64-bit. http://thenewnexus.net/ended-prematurely/installation-was-not-completed-due-to-a-premature-error.html

Reply 0 Kudos « Message Listing « Previous Topic Next Topic » Search This Board CommunityCategoryBoardArticlesUsers turn on suggestions Auto-suggest helps you quickly narrow down your search results by suggesting possible matches as you type. more stack exchange communities company blog Stack Exchange Inbox Reputation and Badges sign up log in tour help Tour Start here for a quick overview of the site Help Center Detailed answers to any questions you might have Meta Discuss the workings and policies of this site About Us Learn more about Stack Overflow the company Business Learn more about hiring developers or posting ads with us Stack Overflow Questions Jobs Documentation Tags Users Badges Ask Question x Dismiss Join the Stack Overflow Community Stack Overflow is a community of 4.7 million programmers, just like you, helping each other. Glossary of Terms Definitions of common antivirus terminology. http://github.com/npm/npm/issues npm ERR!

Installation Ended Prematurely Because Of An Error Windows 7

Will let you know! New Post Related Content Search the Autodesk Knowledge Network for more content. I've searched the internet (I hate the term searched the web) and have found numerous "fixes" yet none have worked. I instert the 1stCD and before the installation starts i get an error: Installation ended prematurely because of an error.

Then try to install it. Dlete all its contents. Download SafeMSI and enable the Windows Installer Service in Safe Mode. Installation Ended Prematurely Because Of An Error Windows 10 share|improve this answer answered Jan 20 '15 at 1:50 jgilli 816 Many Thanks....

Are most Earth polar satellites launched to the South or to the North? Logmein Setup Ended Prematurely Because Of An Error You can now run the installation again and it will install correctly. The root cause for this may be wixtoolset/issues#4462/ . http://forum.thewindowsclub.com/windows-7-management-support/34997-installation-fails-installation-ended-prematurely-because-error.html shenmiweiyi commented Oct 17, 2016 I was facing same issue on windows7 64 bit machine.This is my installing log.I try to many ways and still didn't fix the issue.Please help me lookup and fix this issue.

Professional name different from legal name How to find positive things in a code review? Setup Wizard Ended Prematurely Windows 7 After I had deleted this entry, node installation passed fine. Node.js Foundation member joaocgreis commented Mar 24, 2016 They are used by node, newer and older versions. Thanks!

  • Scroll down to the Windows Event Log service, and ensure it is set to automatic.
  • All features Features by disciplines Stata/MP Which Stata is right for me?
  • reg query "HKLM\SOFTWARE\Microsoft\Windows NT\CurrentVersion\Perflib\_V2Providers\{793c9b44-3d6b-4f57-b5d7-4ff80adcf9a2}" /s reg query "HKLM\SOFTWARE\Microsoft\Windows NT\CurrentVersion\Perflib\_V2Providers\{1e2e15d7-3760-470e-8699-b9db5248edd5}" /s 👍 4 ❤️ 2 samarthRT commented Mar 24, 2016 Hey @Compynerd255, I couldn't locate these keys (GUIDs) on my system registry.

Logmein Setup Ended Prematurely Because Of An Error

I then ran the msi again from an admin command prompt and the node install succeeded. When I run an escalated command prompt, it is running as me, but already escalated (the MSI never needs to ask for escalation), so it works. Installation Ended Prematurely Because Of An Error Windows 7 PS: IF you run ONLY the .net framework 2 after the next boot you will get an error message like "couldnt open...".So as i said before you need to run also the .net framework 3. Setup Wizard Ended Prematurely Because Of An Error How to check access permissions on items for a user via the Security API?

Unselecting the "performance counter" during the installation did the job for me, but I have run the req queries which you provided and got a result for the second one: C:\Windows\system32>reg query "HKLM\SOFTWARE\Microsoft\Windows NT\CurrentVersion\Perflib_V2Providers{1e2e15d7-3760-470e-8699-b9db5248edd5}" /s HKEY_LOCAL_MACHINE\SOFTWARE\Microsoft\Windows NT\CurrentVersion\Perflib_V2Providers{1e2e15d7-3760-470e-8699-b9db5248edd5} ProviderType REG_DWORD 0x0 ApplicationIdentity REG_EXPAND_SZ C:\Program Files\nodejs\node.exe HKEY_LOCAL_MACHINE\SOFTWARE\Microsoft\Windows NT\CurrentVersion\Perflib_V2Providers{1e2e15d7-3760-470e-8699-b9db5248edd5}{3a22a8ec-297c-48ac-ab15-33ec93033fd8} NameResource REG_DWORD 0x1 ExplainResource REG_DWORD 0x3 InstanceType REG_DWORD 0x6 First Counter REG_DWORD 0x2b88 NeutralName REG_SZ Node.js Last Counter REG_DWORD 0x2b9c CounterBlock REG_BINARY 010000000004411000000000000000006400000000000000050000000700000001000000FFFFFFFFFFFFFFFFFFFFFFFFFFFFFFFF000000000200000000044110000000000000000064 00000000000000090000000B00000001000000FFFFFFFFFFFFFFFFFFFFFFFFFFFFFFFF000000000300000000044110000000000000000064000000000000000D0000000F00000001000000FFFFFFFFFFFFFFFFFFFFFFFFFFFFFF FF00000000040000000004411000000000000000006400000000000000110000001300000001000000FFFFFFFFFFFFFFFFFFFFFFFFFFFFFFFF000000000500000000000100000000000000000064000000000000001500000017 00000001000000FFFFFFFFFFFFFFFFFFFFFFFFFFFFFFFF000000000600000000054110000000000000000064000000FDFFFFFF190000001B00000001000000FFFFFFFFFFFFFFFFFFFFFFFFFFFFFFFF0000000007000000000541 10000000000000000064000000FDFFFFFF1D0000001F00000001000000FFFFFFFFFFFFFFFFFFFFFFFFFFFFFFFF00000000080000000000010000000000000000006400000000000000210000002300000002000000FFFFFFFFFF FFFFFFFFFFFFFFFFFFFFFF000000000900000000054110000000000000000064000000FDFFFFFF250000002700000001000000FFFFFFFFFFFFFFFFFFFFFFFFFFFFFFFF000000000A000000000541100000000000000000640000 00FDFFFFFF290000002B00000001000000FFFFFFFFFFFFFFFFFFFFFFFFFFFFFFFF00000000 CounterCount REG_DWORD 0xa Deleting this entry fixed the issue for me which means that I did not have to unselect the "performance counter". 👍 2 😄 2 🎉 2 Node.js Foundation member joaocgreis commented Apr 13, 2016 @ilkercat thanks! @samarthRT sorry for the delay, I had missed this one. http://thenewnexus.net/ended-prematurely/installation-ended-prematurely-because-of-an-error.html I got a similar message from the installer and found that I could go to command prompt and run the MSI with a command line option to make it create a log file (like node-v0.10.24-x64.msi /lxv C:\Logs\Nodejs.log), where you can choose what the log is called and where it goes. System Error 1612. Troubleshooting a Windows Hamachi Client Failing to Connect to the Hamachi Network Adapter Why do I get a '1921 error' when installing LogMeIn? How To Fix Installation Ended Prematurely Because Of An Error

node v5.9.0 npm ERR! more hot questions question feed lang-js about us tour help blog chat data legal privacy policy work here advertising info mobile contact us feedback Technology Life / Arts Culture / Recreation Science Other Stack Overflow Server Fault Super User Web Applications Ask Ubuntu Webmasters Game Development TeX - LaTeX Programmers Unix & Linux Ask Different (Apple) WordPress Development Geographic Information Systems Electrical Engineering Android Enthusiasts Information Security Database Administrators Drupal Answers SharePoint User Experience Mathematica Salesforce ExpressionEngine® Answers Cryptography Code Review Magento Signal Processing Raspberry Pi Programming Puzzles & Code Golf more (7) Photography Science Fiction & Fantasy Graphic Design Movies & TV Music: Practice & Theory Seasoned Advice (cooking) Home Improvement Personal Finance & Money Academia more (8) English Language & Usage Skeptics Mi Yodeya (Judaism) Travel Christianity English Language Learners Japanese Language Arqade (gaming) Bicycles Role-playing Games Anime & Manga more (18) Mathematics Cross Validated (stats) Theoretical Computer Science Physics MathOverflow Chemistry Biology Computer Science Philosophy more (3) Stack Apps Meta Stack Exchange Area 51 Stack Overflow Careers site design / logo © 2016 Stack Exchange Inc; user contributions licensed under cc by-sa 3.0 with attribution required rev 2016.10.18.4108 Stack Overflow works best with JavaScript enabled current community chat Stack Overflow Meta Stack Overflow your communities Sign up or log in to customize your list. I get "node.js Setup Wizard ended prematurely..." I even tried to install different versions. Check This Out Please suggest Now as I'm trying to access the npm command, it results in another error : C:\WINDOWS\system32>npm npm ERR!

more... Oracle Vm Virtualbox Setup Wizard Ended Prematurely Why mount doesn't respect option ro Why don't we have helicopter airlines? thanks Reply 0 Kudos *Gehenna

Post 2 of 5 Share Report Re: Installation ended prematurely because of an error Options Mark as New Bookmark Subscribe Subscribe to RSS Feed Highlight Print Email to a Friend Report 05-06-2007 09:18 AM in reply to: krals krals wrote: > Hi to all, > I have a problem during the installation of AutoCad 2007. > I instert the 1stCD and before the installation starts i get an error: Installation ended prematurely because of an error. > > What can i do about it ? > > thanks > Re-boot and make sure you do NOT have anti-virus program running and then try to install again.

Cannot find module 'glob' npm ERR!

The older version of Node.js cannot be removed. Node.js Foundation member joaocgreis commented Jan 8, 2016 @samarthRT Can you make sure there is no previous version installed in Control Panel, and uninstall it from there if there is? All rights reserved. Virtualbox Fatal Error During Installation Windows 10 They are mainly related to some Microsoft Windows system DLL configurations.

Select "Entire feature will be unavailable". Title Installation error in Windows Vista Authors Hua Peng, StataCorp Jennifer Rolfes, StataCorp Some users may encounter the following error message when attempting to install Stata on a Windows Vista machine: “Installation ended prematurely because of an error.” This occurs immediately after the welcome screen. This worked for me too. this contact form None of the other solutions worked for me, but I did install as admin and log the output.

argv "C:\Program Files\nodejs\node.exe" "C:\Users\firstName lastName\AppData\Roaming\npm\node_modules\npm\bin\npm-cli.js" npm ERR! Thanks for your your help folks. I was attempting to do a per-user install of v4.6.0 on 64-bit (Windows) - "Microsoft Windows 7 Professional 6.1.7601 Service Pack 1 Build 7601" via msiexec /I node-v4.6.0-x64.msi ALLUSERS=2 MSIINSTALLPERUSER=1 I encountered the same issue. Log in Forgotten Your Password?

What happens if one brings more than 10,000 USD with them into the US? javascript node.js share|improve this question asked Jan 12 '15 at 6:19 muni 578713 add a comment| 2 Answers 2 active oldest votes up vote 1 down vote accepted It seems that the following command "wevtutil.exe" im "C:\Program Files\nodejs\node_etw_provider.man" is failing on your setup with the following error: ERROR - Error 0x800706b5: CAQuietExec Failed A helpful suggestion on how to fix this issue can be found at http://blogs.technet.com/b/odsupport/archive/2010/12/30/troubleshooting-office-installation-failures.aspx: This issue can occur if the Windows Event Log service is not running. Showing results for  Search instead for  Do you mean  Search AutoCAD 2007/2008/2009 Post to the Community Have questions about Autodesk products? In my case, we are running in an Active Directory domain environment and some of our folders that are normally local are redirected to a network share so they are always there no matter what computer we log into.

I had tried some solutions given in the following link... Make sure you are logged in as an administrator (not just running the setup as an administrator). Linked 7 Rollback on node.js install on Windows 7 x64 PC 0 Node.js Setup Wizard ended Prematurely on Windows 7 32 bit 4 Node JS installation ends prematurely 0 Node.js Setup Wizard ended prematurely on Windows 7 64 bit 0 Node.js Setup endes with Prematurely message on Windows 7 32bit Related 1040How do I debug Node.js applications?1267How do I get started with Node.js2204How to decide when to use Node.js?678How to exit in Node.js929What is the purpose of Node.js module.exports and how do you use it?673How can I update Node.js and npm to the next versions?0Node.js Setup Wizard ended Prematurely on Windows 7 32 bit0Node.js Setup Wizard ended prematurely on Windows 7 64 bit0Node.js setup wizard ended prematurely on Windows 10 64bit0Node.js Setup endes with Prematurely message on Windows 7 32bit Hot Network Questions How can I get a visa for India on a 2-day notice? Thanks, Bobb Reply With Quote 30th January 2013,10:23 #2 HappyAndyK Site Administrator Join Date Jun 2008 Posts 7,112 Some things you could try - in no particular order: Clear your Temp folder.

Resolution (for me) Oddly enough, just running an admin escalated command prompt first, and then running the MSI lets it install correctly. What could it be? Reboot the machine and everything was ok. Run MSCONFIG.EXE.2.

Пропустить RUДобавить видеоВойтиПоиск Загрузка... Выберите язык. Закрыть Подробнее… View this message in English Текущий язык просмотра YouTube: Русский. Выбрать другой язык можно в списке ниже. Not the answer you're looking for?